Reaction Details
TargetSerine/threonine-protein kinase Chk1
LigandBDBM92906
Substrate/Competitorn/a
Meas. Tech.CHK1 Inhibition Assay
pH7.4±0
Temperature295.15±0 K
Ki 1.75±0.27 nM
Citation Vanderpool, DJohnson, TOPing, CBergqvist, SAlton, GPhonephaly, SRui, ELuo, CDeng, YLGrant, SQuenzer, TMargosiak, SRegister, JBrown, EErmolieff, J Characterization of the CHK1 allosteric inhibitor binding site. Biochemistry48:9823-30 (2009) 
 
Serine/threonine-protein kinase Chk1
Name:Serine/threonine-protein kinase Chk1
Type:Enzyme Catalytic Domain
Mol. Mass.:54443.02
Organism:Homo sapiens (Human)
Description:gi_166295192
Residue:476
BDBM92906
NameBDBM92906
Synonyms:CHK1 compound 1
TypeSmall mnolecule
Emp. Form.C25H23N5O5
Mol. Mass.473.4806
SMILESO[C@H]1CN(C[C@H]1O)C(=O)c1[nH]c2cc(NC(=O)C3C[C@H]3c3ccccc3)cc3c2c1cn[nH]c3=O