Reaction Details
TargetIntegrin alpha-V/beta-8
LigandBDBM279563
Substrate/Competitorn/a
Meas. Tech.Solid Phase Receptor Assay (SPRA) for alphaVbeta8
pH7.4±n/a
Temperature298.15±n/a K
IC50 0.400±n/a nM
Commentsextracted
Citation Ruminski, PGGriggs, DW Meta-azacyclic amino benzoic acid derivatives as pan integrin antagonists US Patent US10035778 Publication Date 7/31/2018
 
Integrin alpha-V/beta-8
Name:Integrin alpha-V/beta-8
Type:Enzyme
Mol. Mass.:n/a
Description:n/a
Components:This complex has 2 components.
Component 1
Name:Integrin alpha-V
Synonyms:ITAV_HUMAN Integrin alpha-V/alpha-5 VNRA Vitronectin receptor | Vitronectin receptor subunit alpha
Type:PROTEIN
Mol. Mass.:116024.92
Organism:Homo sapiens (Human)
Description:ChEMBL_582336
Residue:1048
Component 2
Name:Integrin beta-8
Synonyms:ITB8_HUMAN | ITGB8
Type:Protein
Mol. Mass.:85643.68
Organism:Homo sapiens (Human)
Description:n/a
Residue:769
BDBM279563
NameBDBM279563
Synonyms:(3S)-3-[3-bromo-5-(difluoromethyl)phenyl)-3-(2-(3-hydroxy-5-((5-hydroxy-1,4,5,6-tetrahydropyrimidin-2-yl)amino)benzamido)acetamido]propanoic acid US10577330, Example 4
TypeSmall organic molecule
Emp. Form.C23H24BrF2N5O6
Mol. Mass.584.367
SMILESOC1CNC(Nc2cc(O)cc(c2)C(=O)NCC(=O)N[C@@H](CC(O)=O)c2cc(Br)cc(c2)C(F)F)=NC1