Reaction Details
TargetIntegrin alpha-V/beta-5
LigandBDBM279568
Substrate/Competitorn/a
Meas. Tech.Solid Phase Receptor Assay (SPRA) for alphaVbeta5
pH7.4±n/a
Temperature298.15±n/a K
IC50 0.300±n/a nM
Commentsextracted
Citation Ruminski, PGGriggs, DW Meta-azacyclic amino benzoic acid derivatives as pan integrin antagonists US Patent US10035778 Publication Date 7/31/2018
 
Integrin alpha-V/beta-5
Name:Integrin alpha-V/beta-5
Type:Enzyme
Mol. Mass.:n/a
Description:n/a
Components:This complex has 2 components.
Component 1
Name:Integrin alpha-V
Synonyms:ITAV_HUMAN Integrin alpha-V/alpha-5 VNRA Vitronectin receptor | Vitronectin receptor subunit alpha
Type:PROTEIN
Mol. Mass.:116024.92
Organism:Homo sapiens (Human)
Description:ChEMBL_582336
Residue:1048
Component 2
Name:Integrin beta-5
Synonyms:ITB5_HUMAN | ITGB5
Type:PROTEIN
Mol. Mass.:88047.37
Organism:Homo sapiens (Human)
Description:EBI_10915
Residue:799
BDBM279568
NameBDBM279568
Synonyms:(3S)-3-[3-bromo-5-(trifluoromethyl)phenyl]-3-[[2-[[5-[(5-hydroxy-1,4,5,6-tetrahydropyrimidin-2-yl)amino]pyridine-3-carbonyl]amino]acetyl]amino]propanoic acid US10577330, Example 9
TypeSmall organic molecule
Emp. Form.C22H22BrF3N6O5
Mol. Mass.587.346
SMILESOC1CNC(Nc2cncc(c2)C(=O)NCC(=O)N[C@@H](CC(O)=O)c2cc(Br)cc(c2)C(F)(F)F)=NC1