Reaction Details
TargetPeptidyl-prolyl cis-trans isomerase A
LigandBDBM92914
Substrate/Competitorn/a
Meas. Tech.PPIase Assay
pH7.8±n/a
Temperature278.15±n/a K
Ki 1.7e+3± 5e+2 nM
Commentsextracted
Citation Daum, SSchumann, MMathea, SAumüller, TBalsley, MAConstant, SLde Lacroix, BFKruska, FBraun, MSchiene-Fischer, C Isoform-specific inhibition of cyclophilins. Biochemistry48:6268-77 (2009) 
 
Peptidyl-prolyl cis-trans isomerase A
Name:Peptidyl-prolyl cis-trans isomerase A
Type:Protein
Mol. Mass.:18015.32
Organism:Homo sapiens (Human)
Description:P62937
Residue:165
BDBM92914
NameBDBM92914
Synonyms:Aryl 1-indanylketone, 3
TypeSmall molecule
Emp. Form.C23H20FNO3
Mol. Mass.377.4082
SMILESCOc1ccc(F)cc1-c1cc(N)c(O)c(c1)C(=O)C1CCc2ccccc12