Reaction Details
TargetPeptidyl-prolyl cis-trans isomerase B
LigandBDBM92915
Substrate/Competitorn/a
Meas. Tech.PPIase Assay
pH7.8±n/a
Temperature278.15±n/a K
Ki 2.1e+3± 3e+2 nM
Commentsextracted
Citation Daum, SSchumann, MMathea, SAumüller, TBalsley, MAConstant, SLde Lacroix, BFKruska, FBraun, MSchiene-Fischer, C Isoform-specific inhibition of cyclophilins. Biochemistry48:6268-77 (2009) 
 
Peptidyl-prolyl cis-trans isomerase B
Name:Peptidyl-prolyl cis-trans isomerase B
Type:Protein
Mol. Mass.:23751.82
Organism:Homo sapiens (Human)
Description:P23284
Residue:216
BDBM92915
NameBDBM92915
Synonyms:Aryl 1-indanylketone, 4
TypeSmall molecule
Emp. Form.C24H19F3O3
Mol. Mass.412.4011
SMILESCOc1ccc(cc1C(=O)C1CCc2ccccc12)-c1ccc(OC(F)(F)F)cc1