Reaction Details
TargetCarbonic anhydrase 2
LigandBDBM10875
Substrate/Competitorn/a
Meas. Tech.Inhibition Assay
Ki 1.1±0.2 nM
Citation Genis, CSippel, KHCase, NCao, WAvvaru, BSTartaglia, LJGovindasamy, LTu, CAgbandje-McKenna, MSilverman, DNRosser, CJMcKenna, R Design of a carbonic anhydrase IX active-site mimic to screen inhibitors for possible anticancer properties. Biochemistry48:1322-31 (2009) 
 
Carbonic anhydrase 2
Name:Carbonic anhydrase 2
Type:Enzyme
Mol. Mass.:29250.71
Organism:Homo sapiens (Human)
Description:P00918
Residue:260
BDBM10875
NameBDBM10875
Synonyms:5-(2-chlorophenyl)-1,3,4-thiadiazole-2-sulfonamide Chlorzolamide, CHL JMC523116 Compound 19 | aromatic/heteroaromatic sulfonamide 20
TypeSmall organic molecule
Emp. Form.C8H6ClN3O2S2
Mol. Mass.275.735
SMILESNS(=O)(=O)c1nnc(s1)-c1ccccc1Cl