Reaction Details
TargetCarbonic anhydrase 2
LigandBDBM92939
Substrate/Competitorn/a
Meas. Tech.Inhibition Assay
Ki 11.4±2 nM
Citation Genis, CSippel, KHCase, NCao, WAvvaru, BSTartaglia, LJGovindasamy, LTu, CAgbandje-McKenna, MSilverman, DNRosser, CJMcKenna, R Design of a carbonic anhydrase IX active-site mimic to screen inhibitors for possible anticancer properties. Biochemistry48:1322-31 (2009) 
 
Carbonic anhydrase 2
Name:Carbonic anhydrase 2
Type:Enzyme
Mol. Mass.:29250.71
Organism:Homo sapiens (Human)
Description:P00918
Residue:260
BDBM92939
NameBDBM92939
Synonyms:Methazolamide, MZM
TypeSmall molecule
Emp. Form.C6H9N3O3S2
Mol. Mass.235.284
SMILESCC1N=C(S\C1=N\C(C)=O)S(N)(=O)=O