Reaction Details
TargetThiamine-binding periplasmic protein
LigandBDBM50373877
Substrate/Competitorn/a
Meas. Tech.Titration Assay
Kd 3.8±0.3 nM
Citation Soriano, EVRajashankar, KRHanes, JWBale, SBegley, TPEalick, SE Structural similarities between thiamin-binding protein and thiaminase-I suggest a common ancestor. Biochemistry47:1346-57 (2008) 
 
Thiamine-binding periplasmic protein
Name:Thiamine-binding periplasmic protein
Type:Protein
Mol. Mass.:36163.97
Organism:Escherichia coli (strain K12)
Description:P31550
Residue:327
BDBM50373877
NameBDBM50373877
Synonyms:Betaxin THIAMINE (VIT B1) Thiamine | Vitamin B 1
TypeSmall organic molecule
Emp. Form.C12H17N4OS
Mol. Mass.265.354
SMILESCc1c(CCO)sc[n+]1Cc1cnc(C)nc1N