Reaction Details
TargetProtein kinase C alpha type
LigandBDBM92977
Substrate/Competitorn/a
Meas. Tech.Mixed Micelle Assay
pH7.5±0
Temperature303.15±0 K
IC50 1.64e+5±n/a nM
Citation Bottega, REpand, RM Inhibition of protein kinase C by cationic amphiphiles. Biochemistry31:9025-30 (1992) 
 
Protein kinase C alpha type
Name:Protein kinase C alpha type
Type:Protein
Mol. Mass.:76797.67
Organism:Rattus norvegicus (Rat)
Description:P05696
Residue:672
BDBM92977
NameBDBM92977
Synonyms:Amphiphile, XII
TypeSmall molecule
Emp. Form.C35H64N4O5
Mol. Mass.620.9054
SMILESCC(C)CCCC(N)C1CCN2C3OC=C4CC(CCC4(C)C3CCC12C)OC(=O)CCC(=O)OCC[NH+](C)CC[NH+](C)C