Reaction Details
TargetTranslocator protein
LigandBDBM279584
Substrate/Competitorn/a
Meas. Tech.[3H]PK 11195 radio-assay
Ki 2.50±n/a nM
Citation Gavish, MVeenman, JAShterenberg, AMarek, IVainshtein, AAvital, A Quinazoline scaffold based compounds, pharmaceutical compositions and methods of use thereof US Patent US10035780 Publication Date 7/31/2018
 
Translocator protein
Name:Translocator protein
Type:Enzyme
Mol. Mass.:18834.74
Organism:Homo sapiens (Human)
Description:P30536
Residue:169
BDBM279584
NameBDBM279584
Synonyms:US10035780, Compound 8
TypeSmall organic molecule
Emp. Form.C19H18ClN3O2
Mol. Mass.355.818
SMILESCCN(CC)C(=O)Oc1nc(nc2ccccc12)-c1ccccc1Cl