Reaction Details
TargetCarbamoyl-phosphate synthase small chain
LigandBDBM93010
Substrate/Competitorn/a
Meas. Tech.Enzyme Assay
pH7.5±0
Ki 9e+3±n/a nM
Citation Miran, SGChang, SHRaushel, FM Role of the four conserved histidine residues in the amidotransferase domain of carbamoyl phosphate synthetase. Biochemistry30:7901-7 (1991) 
 
Carbamoyl-phosphate synthase small chain
Name:Carbamoyl-phosphate synthase small chain
Type:Protein
Mol. Mass.:41429.00
Organism:Escherichia coli (strain K12)
Description:P0A6F1
Residue:382
BDBM93010
NameBDBM93010
Synonyms:Glutamine Analogue, 2
TypeSmall molecule
Emp. Form.C5H10N2O4
Mol. Mass.162.1439
SMILES[NH3+]C(CCC(=O)NO)C([O-])=O