Reaction Details
TargetCannabinoid receptor 2
LigandBDBM93029
Substrate/Competitorn/a
Meas. Tech.Competition Binding Assay
Ki 2364±642 nM
Citation Renault, NLaurent, XFarce, AEl Bakali, JMansouri, RGervois, PMillet, RDesreumaux, PFurman, CChavatte, P Virtual Screening of CB2 Receptor Agonists from Bayesian Network and High-Throughput Docking: Structural Insights into Agonist-Modulated GPCR Features. Chem Biol Drug Des81:442-454 (2013) 
 
Cannabinoid receptor 2
Name:Cannabinoid receptor 2
Type:G Protein-Coupled Receptor (GPCR)
Mol. Mass.:39690.94
Organism:Homo sapiens (Human)
Description:P34972
Residue:360
BDBM93029
NameBDBM93029
Synonyms:CB2 Inhibitor, 5
TypeSmall molecule
Emp. Form.C24H28N2O2
Mol. Mass.376.4913
SMILESCOc1ccc(CN2CCCn3c4C2CCCc4c2cc(C)ccc32)cc1O