Reaction Details
TargetCannabinoid receptor 2
LigandBDBM93030
Substrate/Competitorn/a
Meas. Tech.Competition Binding Assay
Ki 4440±690 nM
Citation Renault, NLaurent, XFarce, AEl Bakali, JMansouri, RGervois, PMillet, RDesreumaux, PFurman, CChavatte, P Virtual Screening of CB2 Receptor Agonists from Bayesian Network and High-Throughput Docking: Structural Insights into Agonist-Modulated GPCR Features. Chem Biol Drug Des81:442-454 (2013) 
 
Cannabinoid receptor 2
Name:Cannabinoid receptor 2
Type:G Protein-Coupled Receptor (GPCR)
Mol. Mass.:39690.94
Organism:Homo sapiens (Human)
Description:P34972
Residue:360
BDBM93030
NameBDBM93030
Synonyms:CB2 Inhibitor, 6
TypeSmall molecule
Emp. Form.C29H31FN2O4
Mol. Mass.490.5658
SMILESCC1CCCN(Cc2cc(ccc2OCC(=O)NCc2ccccc2F)-c2ccc3OCOc3c2)C1