Reaction Details
TargetCannabinoid receptor 2
LigandBDBM93035
Substrate/Competitorn/a
Meas. Tech.Competition Binding Assay
Ki 36860±8300 nM
Citation Renault, NLaurent, XFarce, AEl Bakali, JMansouri, RGervois, PMillet, RDesreumaux, PFurman, CChavatte, P Virtual Screening of CB2 Receptor Agonists from Bayesian Network and High-Throughput Docking: Structural Insights into Agonist-Modulated GPCR Features. Chem Biol Drug Des81:442-454 (2013) 
 
Cannabinoid receptor 2
Name:Cannabinoid receptor 2
Type:G Protein-Coupled Receptor (GPCR)
Mol. Mass.:39690.94
Organism:Homo sapiens (Human)
Description:P34972
Residue:360
BDBM93035
NameBDBM93035
Synonyms:CB2 Inhibitor, 11
TypeSmall molecule
Emp. Form.C25H25FN2O3S
Mol. Mass.452.541
SMILESCC1=CC(C(=O)CN2C(=O)NC(C)(C2=O)c2ccc(F)cc2)=C(C)C1CCc1cccs1