Reaction Details
TargetDNA gyrase subunit A
LigandBDBM93040
Substrate/Competitorn/a
Meas. Tech.Enzyme Assay
IC50 1.00e+5±n/a nM
Citation Karkare, SChung, TTCollin, FMitchenall, LAMcKay, ARGreive, SJMeyer, JJLall, NMaxwell, A The naphthoquinone diospyrin is an inhibitor of DNA gyrase with a novel mechanism of action. J Biol Chem288:5149-56 (2013) 
 
DNA gyrase subunit A
Name:DNA gyrase subunit A
Type:Protein
Mol. Mass.:92261.11
Organism:Mycobacterium tuberculosis (strain ATCC 25618 / H37Rv)
Description:P9WG47
Residue:838
BDBM93040
NameBDBM93040
Synonyms:Isodiospyrin | MAR-UNI-c84db004-17
TypeSmall molecule
Emp. Form.C22H14O6
Mol. Mass.374.343
SMILESCc1cc(O)c2C(=O)C=CC(=O)c2c1-c1c(C)cc2C(=O)C=CC(=O)c2c1O