Reaction Details
TargetDNA gyrase subunit A
LigandBDBM93041
Substrate/Competitorn/a
Meas. Tech.Enzyme Assay
IC50>2.00e+5±n/a nM
Citation Karkare, SChung, TTCollin, FMitchenall, LAMcKay, ARGreive, SJMeyer, JJLall, NMaxwell, A The naphthoquinone diospyrin is an inhibitor of DNA gyrase with a novel mechanism of action. J Biol Chem288:5149-56 (2013) 
 
DNA gyrase subunit A
Name:DNA gyrase subunit A
Type:Protein
Mol. Mass.:92261.11
Organism:Mycobacterium tuberculosis (strain ATCC 25618 / H37Rv)
Description:P9WG47
Residue:838
BDBM93041
NameBDBM93041
Synonyms:Shinanolone
TypeSmall molecule
Emp. Form.C11H12O3
Mol. Mass.192.2112
SMILESC[C@@H]1CC(=O)c2c(O)cccc2[C@@H]1O