Reaction Details
Target3-oxoacyl-[acyl-carrier-protein] synthase 1
LigandBDBM93049
Substrate/Competitorn/a
Meas. Tech.Binding Fluorescence Titrations
pH8.5±0
Ki 1.21e+4± 6e+2 nM
Citation Kapilashrami, KBommineni, GRMachutta, CAKim, PLai, CTSimmerling, CPicart, FTonge, PJ Thiolactomycin-based ß-Ketoacyl-AcpM Synthase A (KasA) Inhibitors: FRAGMENT-BASED INHIBITOR DISCOVERY USING TRANSIENT ONE-DIMENSIONAL NUCLEAR OVERHAUSER EFFECT NMR SPECTROSCOPY. J Biol Chem288:6045-52 (2013) 
 
3-oxoacyl-[acyl-carrier-protein] synthase 1
Name:3-oxoacyl-[acyl-carrier-protein] synthase 1
Type:Protein
Mol. Mass.:43305.57
Organism:Mycobacterium tuberculosis
Description:P9WQD8
Residue:416
BDBM93049
NameBDBM93049
Synonyms:TLM analog, 6
TypeSmall molecule
Emp. Form.C12H11F3O3S
Mol. Mass.292.274
SMILESC\C(C=C)=C/[C@@]1(C)SC(=O)C(C(=O)C(F)(F)F)C1=O