Reaction Details
Target3-oxoacyl-[acyl-carrier-protein] synthase 1
LigandBDBM93048
Substrate/Competitorn/a
Meas. Tech.Binding Fluorescence Titrations
pH8.5±0
Ki 9e+2± 2e+2 nM
Citation Kapilashrami, KBommineni, GRMachutta, CAKim, PLai, CTSimmerling, CPicart, FTonge, PJ Thiolactomycin-based ß-Ketoacyl-AcpM Synthase A (KasA) Inhibitors: FRAGMENT-BASED INHIBITOR DISCOVERY USING TRANSIENT ONE-DIMENSIONAL NUCLEAR OVERHAUSER EFFECT NMR SPECTROSCOPY. J Biol Chem288:6045-52 (2013) 
 
3-oxoacyl-[acyl-carrier-protein] synthase 1
Name:3-oxoacyl-[acyl-carrier-protein] synthase 1
Type:Protein
Mol. Mass.:43305.57
Organism:Mycobacterium tuberculosis
Description:P9WQD8
Residue:416
BDBM93048
NameBDBM93048
Synonyms:TLM analog, 5
TypeSmall molecule
Emp. Form.C12H14O3S
Mol. Mass.238.303
SMILESCC(=O)C1C(=O)S[C@](C)(\C=C(/C)C=C)C1=O