Reaction Details
TargetAnthranilate phosphoribosyltransferase
LigandBDBM93075
Substrate/Competitorn/a
Meas. Tech.Fluoresence-based Assay
Ki 1.5e+4± 4e+3 nM
Citation Castell, AShort, FLEvans, GLCookson, TVBulloch, EMJoseph, DDLee, CEParker, EJBaker, ENLott, JS The Substrate Capture Mechanism of Mycobacterium tuberculosis Anthranilate Phosphoribosyltransferase Provides a Mode for Inhibition. Biochemistry52:1776-1787 (2013) 
 
Anthranilate phosphoribosyltransferase
Name:Anthranilate phosphoribosyltransferase
Type:Enzyme
Mol. Mass.:37738.87
Organism:Mycobacterium tuberculosis
Description:P9WFX4
Residue:370
BDBM93075
NameBDBM93075
Synonyms:ACS No 145
TypeSmall molecule
Emp. Form.C9H10NO4
Mol. Mass.196.1805
SMILESCOc1cc(N)c(cc1OC)C([O-])=O