Reaction Details
TargetProstaglandin G/H synthase 1 [582-599]
LigandBDBM93104
Substrate/Competitorn/a
Meas. Tech.In Vitro COX Inhibition Assay
IC50>1.00e+5±n/a nM
Citation Zarghi, AArefi, HDadrass, OGTorabi, S Design and synthesis of new 2-aryl, 3-benzyl- (1,3-oxazolidine or 1,3-thiazolidine)-4-ones as selective cyclooxygenase (COX-2) inhibitor Med Chem Res19:782-793 (2009)  
 
Prostaglandin G/H synthase 1 [582-599]
Name:Prostaglandin G/H synthase 1 [582-599]
Type:Protein
Mol. Mass.:1879.89
Organism:Homo sapiens (Human)
Description:Q6LCE7
Residue:18
PDASQDDGPAVERPSTEL
BDBM93104
NameBDBM93104
Synonyms:COX inhibitor, 5b
TypeSmall molecule
Emp. Form.C16H15NOS
Mol. Mass.269.361
SMILESO=C1CSC(N1Cc1ccccc1)c1ccccc1