Reaction Details
TargetDNA ligase A
LigandBDBM22981
Substrate/Competitorn/a
Meas. Tech.Enzyme Assay
IC50 9.65e+3± 5e+2 nM
Citation Dube, CKukshal, VSrivastava, SKTripathi, RPRamachandran, R NAD+-dependent DNA ligase (Rv3014c) from M. tuberculosis: Strategies for inhibitor design Medicinal Chemistry Research17:189-198 (2008)  
 
DNA ligase A
Name:DNA ligase A
Type:Enzyme
Mol. Mass.:75276.13
Organism:Mycobacterium tuberculosis
Description:The C-terminally His-tagged full-length MtuLigA protein was cloned and expressed in E. coli.
Residue:691
BDBM22981
NameBDBM22981
Synonyms:Glycosyl Ureides, 3a glycosyl ureide-based inhibitor, 1
TypeSmall organic molecule
Emp. Form.C33H37ClN2O7
Mol. Mass.609.109
SMILESCCOC(=O)CC(C1O[C@H]2OC(C)(C)O[C@H]2[C@@H]1OCc1ccccc1)N(Cc1ccccc1)C(=O)Nc1ccc(Cl)cc1