Reaction Details
TargetDNA ligase A
LigandBDBM93108
Substrate/Competitorn/a
Meas. Tech.Enzyme Assay
IC50 4.62e+4± 1e+3 nM
Citation Dube, CKukshal, VSrivastava, SKTripathi, RPRamachandran, R NAD+-dependent DNA ligase (Rv3014c) from M. tuberculosis: Strategies for inhibitor design Medicinal Chemistry Research17:189-198 (2008)  
 
DNA ligase A
Name:DNA ligase A
Type:Enzyme
Mol. Mass.:75276.13
Organism:Mycobacterium tuberculosis
Description:The C-terminally His-tagged full-length MtuLigA protein was cloned and expressed in E. coli.
Residue:691
BDBM93108
NameBDBM93108
Synonyms:Glycosylamine, 4
TypeSmall Molecule
Emp. Form.C37H54N2O10
Mol. Mass.686.8321
SMILESCC1(C)O[C@H]2OC(C(CCO)NCCCN[C@@H](CCO)C3O[C@@H]4OC(C)(C)O[C@@H]4[C@H]3OCc3ccccc3)[C@H](OCc3ccccc3)[C@H]2O1