Reaction Details
TargetTyrosine-protein phosphatase non-receptor type 1
LigandBDBM93116
Substrate/CompetitorBDBM24514
Meas. Tech.In Vitro Assay
pH7±0
Ki 6.3e+4±n/a nM
IC50 8.8e+4±n/a nM
Citation Maurya, RGupta, PAhmad, GYadav, DKChand, KSingh, ABTamrakar, AKSrivastava, AK Synthesis of 3,5-disubstituted isoxazolines as protein tyrosine phosphatase 1B inhibitors Medicinal Chemistry Research17:123-136 (2008)  
 
Tyrosine-protein phosphatase non-receptor type 1
Name:Tyrosine-protein phosphatase non-receptor type 1
Type:Protein phosphatase
Mol. Mass.:49963.76
Organism:Homo sapiens (Human)
Description:Human recombinant GST-fusion PTP1B (1-435).
Residue:435
BDBM93116
BDBM24514
NameBDBM93116
Synonyms:PTP1B Inhibitor, 14
TypeSmall molecule
Emp. Form.C14H13N3O3
Mol. Mass.271.2713
SMILESCOc1cc(C=O)ccc1C1=NOC(C1)n1ccnc1