Reaction Details
TargetTyrosine-protein phosphatase non-receptor type 1
LigandBDBM93118
Substrate/CompetitorBDBM24514
Meas. Tech.In Vitro Assay
pH7±0
Ki 2.5e+4±n/a nM
IC50 6.27e+4±n/a nM
Citation Maurya, RGupta, PAhmad, GYadav, DKChand, KSingh, ABTamrakar, AKSrivastava, AK Synthesis of 3,5-disubstituted isoxazolines as protein tyrosine phosphatase 1B inhibitors Medicinal Chemistry Research17:123-136 (2008)  
 
Tyrosine-protein phosphatase non-receptor type 1
Name:Tyrosine-protein phosphatase non-receptor type 1
Type:Protein phosphatase
Mol. Mass.:49963.76
Organism:Homo sapiens (Human)
Description:Human recombinant GST-fusion PTP1B (1-435).
Residue:435
BDBM93118
BDBM24514
NameBDBM93118
Synonyms:PTP1B Inhibitor, 19
TypeSmall molecule
Emp. Form.C19H17NO5
Mol. Mass.339.342
SMILESCC(=O)Oc1ccc(C2=NOC(C2)c2ccccc2)c(OC(C)=O)c1