Reaction Details
TargetHigh affinity nerve growth factor receptor
LigandBDBM93145
Substrate/Competitorn/a
Meas. Tech.Inhibition Assay
IC50 4±0.0 nM
Citation Raeppel, SLGaudette, FNguyen, HBeaulieu, NWang, JMaroun, CBesterman, JMVaisburg, A Identification of a Novel Series of Potent TrkA Receptor Tyrosine Kinase Inhibitors International Journal of Medicinal Chemistry2012:1-6 (2012)  
 
High affinity nerve growth factor receptor
Name:High affinity nerve growth factor receptor
Type:n/a
Mol. Mass.:87498.18
Organism:Homo sapiens (Human)
Description:P04629
Residue:796
BDBM93145
NameBDBM93145
Synonyms:2-oxoimidazolidine-1-carboxamide, 5
TypeSmall molecule
Emp. Form.C23H21N5O4
Mol. Mass.431.4439
SMILESCC(=O)Nc1cc(Oc2ccc(NC(=O)N3CCN(C3=O)c3ccccc3)cc2)ccn1