Reaction Details
TargetHigh affinity nerve growth factor receptor
LigandBDBM93149
Substrate/Competitorn/a
Meas. Tech.Inhibition Assay
IC50 2±0.0 nM
Citation Raeppel, SLGaudette, FNguyen, HBeaulieu, NWang, JMaroun, CBesterman, JMVaisburg, A Identification of a Novel Series of Potent TrkA Receptor Tyrosine Kinase Inhibitors International Journal of Medicinal Chemistry2012:1-6 (2012)  
 
High affinity nerve growth factor receptor
Name:High affinity nerve growth factor receptor
Type:n/a
Mol. Mass.:87498.18
Organism:Homo sapiens (Human)
Description:P04629
Residue:796
BDBM93149
NameBDBM93149
Synonyms:2-oxoimidazolidine-1-carboxamide, 16
TypeSmall molecule
Emp. Form.C23H21FN6O4
Mol. Mass.464.449
SMILESCNC(=O)Nc1cc(Oc2ccc(NC(=O)N3CCN(C3=O)c3ccc(F)cc3)cc2)ccn1