Reaction Details
TargetCathepsin K
LigandBDBM93175
Substrate/Competitorn/a
Meas. Tech.Inhibition Assay
pH5.5±0
Ki 25±0.0 nM
Citation Yamashita, DSDong, XOh, HJBrook, CSTomaszek, TASzewczuk, LTew, DGVeber, DF Solid-phase synthesis of a combinatorial array of 1,3-bis(acylamino)-2-butanones, inhibitors of the cysteine proteases cathepsins K and L. J Comb Chem1:207-15 (1999) 
 
Cathepsin K
Name:Cathepsin K
Type:Enzyme
Mol. Mass.:36975.68
Organism:Homo sapiens (Human)
Description:P43235
Residue:329
BDBM93175
NameBDBM93175
Synonyms:Cathepsin Inhibitor, Column 3 Row 2
TypeSmall molecule
Emp. Form.C35H36N4O6
Mol. Mass.608.6835
SMILESCOc1ccc(cc1OC)C(=O)N[C@@H](Cc1ccccc1)C(=O)NC(C)C(=O)CNC(=O)Cc1cccc(c1)-c1ccccn1