Reaction Details
TargetBeta-secretase 1
LigandBDBM116236
Substrate/Competitorn/a
Meas. Tech.Inhibition of Human BACE-1
pH4.5±n/a
Temperature298.15±n/a K
IC50 4.00±n/a nM
Commentsextracted
Citation Badiger, SChebrolu, MHurth, KJacquier, SLueoend, RMMachauer, RRueeger, HTintelnot-Blomley, MVeenstra, SJVoegtle, M Heterocyclic derivatives and their use in the treatment of neurological disorders US Patent US10035794 Publication Date 7/31/2018
 
Beta-secretase 1
Name:Beta-secretase 1
Type:Protein
Mol. Mass.:55755.10
Organism:Homo sapiens (Human)
Description:P56817
Residue:501
BDBM116236
NameBDBM116236
Synonyms:US10035794, Example 11 US8637508, 11
TypeSmall organic molecule
Emp. Form.C20H18F4N6O2
Mol. Mass.450.3895
SMILESCc1cc(cnc1C(=O)Nc1ccc(F)c(n1)[C@]1(C)CO[C@](C)(C(N)=N1)C(F)(F)F)C#N