Reaction Details
TargetGag-Pol polyprotein
LigandBDBM93211
Substrate/Competitorn/a
Meas. Tech.Capsid Assembly Assay
IC50 1.2e+3±n/a nM
Citation Goudreau, NLemke, CTFaucher, AMGrand-Maître, CGoulet, SLacoste, JERancourt, JMalenfant, EMercier, JFTitolo, SMason, SW Novel Inhibitor Binding Site Discovery on HIV-1 Capsid N-Terminal Domain by NMR and X-ray Crystallography. ACS Chem Biol8:1074-82 (2013) 
 
Gag-Pol polyprotein
Name:Gag-Pol polyprotein
Type:Protein
Mol. Mass.:161820.05
Organism:Human immunodeficiency virus type 1 group M subtype B (isolate NY5) (HIV-1)
Description:P12497
Residue:1435
BDBM93211
NameBDBM93211
Synonyms:Benzimidazole Inhibitor, 4
TypeSmall molecule
Emp. Form.C29H23ClN6O2
Mol. Mass.522.985
SMILESOC(=O)c1ccc(cc1)-c1ccc2n(CCCn3ccnc3)c(nc2c1)-c1c[nH]nc1-c1cccc(Cl)c1