Reaction Details
TargetGag-Pol polyprotein
LigandBDBM93212
Substrate/Competitorn/a
Meas. Tech.Capsid Assembly Assay
IC50 6.7e+2±n/a nM
Citation Goudreau, NLemke, CTFaucher, AMGrand-Maître, CGoulet, SLacoste, JERancourt, JMalenfant, EMercier, JFTitolo, SMason, SW Novel Inhibitor Binding Site Discovery on HIV-1 Capsid N-Terminal Domain by NMR and X-ray Crystallography. ACS Chem Biol8:1074-82 (2013) 
 
Gag-Pol polyprotein
Name:Gag-Pol polyprotein
Type:Protein
Mol. Mass.:161820.05
Organism:Human immunodeficiency virus type 1 group M subtype B (isolate NY5) (HIV-1)
Description:P12497
Residue:1435
BDBM93212
NameBDBM93212
Synonyms:Benzimidazole Inhibitor, 5
TypeSmall molecule
Emp. Form.C32H30F3N5O2
Mol. Mass.573.6081
SMILESOC(=O)c1ccc(cc1)-c1ccc2n(CCCN3CCCCC3)c(nc2c1)-c1c[nH]nc1-c1ccc(cc1)C(F)(F)F