Reaction Details
TargetGag-Pol polyprotein
LigandBDBM93214
Substrate/Competitorn/a
Meas. Tech.Capsid Assembly Assay
IC50 8.9e+2±n/a nM
Citation Goudreau, NLemke, CTFaucher, AMGrand-Maître, CGoulet, SLacoste, JERancourt, JMalenfant, EMercier, JFTitolo, SMason, SW Novel Inhibitor Binding Site Discovery on HIV-1 Capsid N-Terminal Domain by NMR and X-ray Crystallography. ACS Chem Biol8:1074-82 (2013) 
 
Gag-Pol polyprotein
Name:Gag-Pol polyprotein
Type:Protein
Mol. Mass.:161820.05
Organism:Human immunodeficiency virus type 1 group M subtype B (isolate NY5) (HIV-1)
Description:P12497
Residue:1435
BDBM93214
NameBDBM93214
Synonyms:Benzodiazepine Inhibitor, 7
TypeSmall molecule
Emp. Form.C21H20F3N3O3
Mol. Mass.419.397
SMILESCOCCN=CC1C(=O)N(C)c2ccc(cc2N(c2ccccc2)C1=O)C(F)(F)F