Reaction Details
TargetSRSF protein kinase 1
LigandBDBM93224
Substrate/Competitorn/a
Meas. Tech.Kinase Assay
IC50 1.14e+5±n/a nM
Citation Urich, RWishart, GKiczun, MRichters, ATidten-Luksch, NRauh, DSherborne, BWyatt, PGBrenk, R De novo design of protein kinase inhibitors by in silico identification of hinge region-binding fragments. ACS Chem Biol8:1044-52 (2013) 
 
SRSF protein kinase 1
Name:SRSF protein kinase 1
Type:Protein
Mol. Mass.:74318.38
Organism:Homo sapiens (Human)
Description:Q96SB4
Residue:655
BDBM93224
NameBDBM93224
Synonyms:Kinase inhibitor, A1
TypeSmall molecule
Emp. Form.C14H18N4O2
Mol. Mass.274.3183
SMILESCC1CN(CC(C)O1)c1nc2ccccn2c(=O)c1N