Reaction Details
TargetFibroblast growth factor receptor 1
LigandBDBM93225
Substrate/Competitorn/a
Meas. Tech.Kinase Assay
IC50 2.52e+5±n/a nM
Citation Urich, RWishart, GKiczun, MRichters, ATidten-Luksch, NRauh, DSherborne, BWyatt, PGBrenk, R De novo design of protein kinase inhibitors by in silico identification of hinge region-binding fragments. ACS Chem Biol8:1044-52 (2013) 
 
Fibroblast growth factor receptor 1
Name:Fibroblast growth factor receptor 1
Type:Receptor
Mol. Mass.:91861.70
Organism:Homo sapiens (Human)
Description:P11362
Residue:822
BDBM93225
NameBDBM93225
Synonyms:Kinase inhibitor, A2
TypeSmall molecule
Emp. Form.C14H9F2N3O
Mol. Mass.273.2376
SMILESNc1cnc2c(cccn2c1=O)-c1c(F)cccc1F