Reaction Details
TargetInsulin-like growth factor 1 receptor
LigandBDBM93225
Substrate/Competitorn/a
Meas. Tech.Kinase Assay
IC50 4.7e+4±n/a nM
Citation Urich, RWishart, GKiczun, MRichters, ATidten-Luksch, NRauh, DSherborne, BWyatt, PGBrenk, R De novo design of protein kinase inhibitors by in silico identification of hinge region-binding fragments. ACS Chem Biol8:1044-52 (2013) 
 
Insulin-like growth factor 1 receptor
Name:Insulin-like growth factor 1 receptor
Type:Protein
Mol. Mass.:154776.79
Organism:Homo sapiens (Human)
Description:P08069
Residue:1367
BDBM93225
NameBDBM93225
Synonyms:Kinase inhibitor, A2
TypeSmall molecule
Emp. Form.C14H9F2N3O
Mol. Mass.273.2376
SMILESNc1cnc2c(cccn2c1=O)-c1c(F)cccc1F