Reaction Details
TargetGlycogen synthase kinase-3 beta
LigandBDBM93227
Substrate/Competitorn/a
Meas. Tech.Kinase Assay
IC50 2.5e+4±n/a nM
Citation Urich, RWishart, GKiczun, MRichters, ATidten-Luksch, NRauh, DSherborne, BWyatt, PGBrenk, R De novo design of protein kinase inhibitors by in silico identification of hinge region-binding fragments. ACS Chem Biol8:1044-52 (2013) 
 
Glycogen synthase kinase-3 beta
Name:Glycogen synthase kinase-3 beta
Type:Enzyme
Mol. Mass.:46756.38
Organism:Homo sapiens (Human)
Description:P49841
Residue:420
BDBM93227
NameBDBM93227
Synonyms:Kinase inhibitor, C2
TypeSmall molecule
Emp. Form.C14H12N2O3S
Mol. Mass.288.322
SMILESCOc1ccc(cc1OC)-c1cc2c(nc[nH]c2=O)s1