Reaction Details
TargetL-lactate dehydrogenase
LigandBDBM93308
Substrate/Competitorn/a
Meas. Tech.Enzyme Assay
IC50 8.8e+4±n/a nM
Citation Choi, SRBeeler, ABPradhan, AWatkins, EBRimoldi, JMTekwani, BAvery, MA Generation of oxamic acid libraries: antimalarials and inhibitors of Plasmodium falciparum lactate dehydrogenase. J Comb Chem9:292-300 (2007) 
 
L-lactate dehydrogenase
Name:L-lactate dehydrogenase
Synonyms:Lactate dehydrogenase (LDH)
Type:Protein
Mol. Mass.:28939.78
Organism:Plasmodium falciparum
Description:B9UDZ5
Residue:267
BDBM93308
NameBDBM93308
Synonyms:Oxamic Acid/Ester, 26
TypeSmall molecule
Emp. Form.C11H21NO3
Mol. Mass.215.2893
SMILESCCCCCCCCCNC(=O)C(O)=O