Reaction Details
TargetL-lactate dehydrogenase
LigandBDBM93310
Substrate/Competitorn/a
Meas. Tech.Enzyme Assay
IC50>2.00e+5±n/a nM
Citation Choi, SRBeeler, ABPradhan, AWatkins, EBRimoldi, JMTekwani, BAvery, MA Generation of oxamic acid libraries: antimalarials and inhibitors of Plasmodium falciparum lactate dehydrogenase. J Comb Chem9:292-300 (2007) 
 
L-lactate dehydrogenase
Name:L-lactate dehydrogenase
Synonyms:Lactate dehydrogenase (LDH)
Type:Protein
Mol. Mass.:28939.78
Organism:Plasmodium falciparum
Description:B9UDZ5
Residue:267
BDBM93310
NameBDBM93310
Synonyms:Oxamic Acid/Ester, 28
TypeSmall molecule
Emp. Form.C8H15NO3
Mol. Mass.173.2096
SMILESCCCCCN(C)C(=O)C(O)=O