Reaction Details
TargetL-lactate dehydrogenase
LigandBDBM93320
Substrate/Competitorn/a
Meas. Tech.Enzyme Assay
IC50 1.46e+5±n/a nM
Citation Choi, SRBeeler, ABPradhan, AWatkins, EBRimoldi, JMTekwani, BAvery, MA Generation of oxamic acid libraries: antimalarials and inhibitors of Plasmodium falciparum lactate dehydrogenase. J Comb Chem9:292-300 (2007) 
 
L-lactate dehydrogenase
Name:L-lactate dehydrogenase
Synonyms:Lactate dehydrogenase (LDH)
Type:Protein
Mol. Mass.:28939.78
Organism:Plasmodium falciparum
Description:B9UDZ5
Residue:267
BDBM93320
NameBDBM93320
Synonyms:Oxamic Acid/Ester, 38
TypeSmall molecule
Emp. Form.C14H17NO3
Mol. Mass.247.2897
SMILESCC(NC(=O)C(O)=O)c1cccc2CCCCc12