Reaction Details
TargetL-lactate dehydrogenase
LigandBDBM23222
Substrate/Competitorn/a
Meas. Tech.Enzyme Assay
IC50 1.16e+5±n/a nM
Citation Choi, SRBeeler, ABPradhan, AWatkins, EBRimoldi, JMTekwani, BAvery, MA Generation of oxamic acid libraries: antimalarials and inhibitors of Plasmodium falciparum lactate dehydrogenase. J Comb Chem9:292-300 (2007) 
 
L-lactate dehydrogenase
Name:L-lactate dehydrogenase
Synonyms:Lactate dehydrogenase (LDH)
Type:Protein
Mol. Mass.:36018.34
Organism:Bos taurus (Bovine)
Description:E1BNS9
Residue:332
BDBM23222
NameBDBM23222
TypeSmall organic molecule
Emp. Form.C2H3NO3
Mol. Mass.89.0501
SMILESNC(=O)C(O)=O