Reaction Details
TargetL-lactate dehydrogenase
LigandBDBM23223
Substrate/Competitorn/a
Meas. Tech.Enzyme Assay
IC50 6.9e+3±n/a nM
Citation Choi, SRBeeler, ABPradhan, AWatkins, EBRimoldi, JMTekwani, BAvery, MA Generation of oxamic acid libraries: antimalarials and inhibitors of Plasmodium falciparum lactate dehydrogenase. J Comb Chem9:292-300 (2007) 
 
L-lactate dehydrogenase
Name:L-lactate dehydrogenase
Synonyms:Lactate dehydrogenase (LDH)
Type:Protein
Mol. Mass.:36018.34
Organism:Bos taurus (Bovine)
Description:E1BNS9
Residue:332
BDBM23223
NameBDBM23223
TypeSmall organic molecule
Emp. Form.C30H30O8
Mol. Mass.518.5544
SMILESCC(C)c1c(O)c(O)c(C=O)c2c(O)c(c(C)cc12)-c1c(C)cc2c(C(C)C)c(O)c(O)c(C=O)c2c1O