Reaction Details
TargetL-lactate dehydrogenase
LigandBDBM93302
Substrate/Competitorn/a
Meas. Tech.Enzyme Assay
IC50 5.9e+4±n/a nM
Citation Choi, SRBeeler, ABPradhan, AWatkins, EBRimoldi, JMTekwani, BAvery, MA Generation of oxamic acid libraries: antimalarials and inhibitors of Plasmodium falciparum lactate dehydrogenase. J Comb Chem9:292-300 (2007) 
 
L-lactate dehydrogenase
Name:L-lactate dehydrogenase
Synonyms:Lactate dehydrogenase (LDH)
Type:Protein
Mol. Mass.:36018.34
Organism:Bos taurus (Bovine)
Description:E1BNS9
Residue:332
BDBM93302
NameBDBM93302
Synonyms:Oxamic Acid/Ester, 20
TypeSmall molecule
Emp. Form.C14H17NO3
Mol. Mass.247.2897
SMILESOC(=O)C(=O)N1CCC(Cc2ccccc2)CC1