Reaction Details
TargetL-lactate dehydrogenase
LigandBDBM93303
Substrate/Competitorn/a
Meas. Tech.Enzyme Assay
IC50 2.5e+4±n/a nM
Citation Choi, SRBeeler, ABPradhan, AWatkins, EBRimoldi, JMTekwani, BAvery, MA Generation of oxamic acid libraries: antimalarials and inhibitors of Plasmodium falciparum lactate dehydrogenase. J Comb Chem9:292-300 (2007) 
 
L-lactate dehydrogenase
Name:L-lactate dehydrogenase
Synonyms:Lactate dehydrogenase (LDH)
Type:Protein
Mol. Mass.:36018.34
Organism:Bos taurus (Bovine)
Description:E1BNS9
Residue:332
BDBM93303
NameBDBM93303
Synonyms:Oxamic Acid/Ester, 21
TypeSmall molecule
Emp. Form.C5H9NO4
Mol. Mass.147.1293
SMILESCOCCNC(=O)C(O)=O