Reaction Details
TargetL-lactate dehydrogenase
LigandBDBM93309
Substrate/Competitorn/a
Meas. Tech.Enzyme Assay
IC50 3.2e+4±n/a nM
Citation Choi, SRBeeler, ABPradhan, AWatkins, EBRimoldi, JMTekwani, BAvery, MA Generation of oxamic acid libraries: antimalarials and inhibitors of Plasmodium falciparum lactate dehydrogenase. J Comb Chem9:292-300 (2007) 
 
L-lactate dehydrogenase
Name:L-lactate dehydrogenase
Synonyms:Lactate dehydrogenase (LDH)
Type:Protein
Mol. Mass.:36018.34
Organism:Bos taurus (Bovine)
Description:E1BNS9
Residue:332
BDBM93309
NameBDBM93309
Synonyms:Oxamic Acid/Ester, 27
TypeSmall molecule
Emp. Form.C12H14N2O3
Mol. Mass.234.2512
SMILESOC(=O)C(=O)N1CCN(CC1)c1ccccc1