Reaction Details
TargetL-lactate dehydrogenase
LigandBDBM93324
Substrate/Competitorn/a
Meas. Tech.Enzyme Assay
IC50 5.1e+4±n/a nM
Citation Choi, SRBeeler, ABPradhan, AWatkins, EBRimoldi, JMTekwani, BAvery, MA Generation of oxamic acid libraries: antimalarials and inhibitors of Plasmodium falciparum lactate dehydrogenase. J Comb Chem9:292-300 (2007) 
 
L-lactate dehydrogenase
Name:L-lactate dehydrogenase
Synonyms:Lactate dehydrogenase (LDH)
Type:Protein
Mol. Mass.:28939.78
Organism:Plasmodium falciparum
Description:B9UDZ5
Residue:267
BDBM93324
NameBDBM93324
Synonyms:Oxamic Acid/Ester, 42
TypeSmall molecule
Emp. Form.C10H10BrNO3
Mol. Mass.272.095
SMILESOC(=O)C(=O)NCCc1ccc(Br)cc1