Reaction Details
TargetCannabinoid receptor 1
LigandBDBM93454
Substrate/Competitorn/a
Meas. Tech.Inhibition Assay
IC50 620±0.0 nM
Citation Pendri, ADodd, DSChen, JCvijic, MEKang, LBaska, RACarlson, KEBurford, NTSun, CEwing, WRGerritz, SW Solid phase synthesis of 1,5-diarylpyrazole-4-carboxamides: discovery of antagonists of the CB-1 receptor. ACS Comb Sci14:197-204 (2012) 
 
Cannabinoid receptor 1
Name:Cannabinoid receptor 1
Type:G Protein-Coupled Receptor (GPCR)
Mol. Mass.:52868.96
Organism:Homo sapiens (Human)
Description:P21554
Residue:472
BDBM93454
NameBDBM93454
Synonyms:hCB1 Inhibitor, 2{5,1,7}
TypeSmall molecule
Emp. Form.C27H25N3O
Mol. Mass.407.5069
SMILESCc1cccc(c1)-n1ncc(C(=O)NCC2CC2)c1-c1ccc(cc1)-c1ccccc1