Reaction Details
TargetEndothelial PAS domain-containing protein 1
LigandBDBM59529
Substrate/Competitorn/a
IC50<1000±n/a nM
Citation PubChem, PC Dose response confirmation of uHTS identification of HIF-2a Inhibitors in a luminesence assay PubChem Bioassay(2012)[AID]
 
Endothelial PAS domain-containing protein 1
Name:Endothelial PAS domain-containing protein 1
Type:PROTEIN
Mol. Mass.:96453.58
Organism:Homo sapiens (Human)
Description:ChEMBL_1506501
Residue:870
BDBM59529
NameBDBM59529
Synonyms:3-[3-(4-tert-butylphenyl)-1,2,4-oxadiazol-5-yl]-N-(2-furanylmethyl)propanamide 3-[3-(4-tert-butylphenyl)-1,2,4-oxadiazol-5-yl]-N-(furan-2-ylmethyl)propanamide SMR000291152 | cid_1828296
TypeSmall organic molecule
Emp. Form.C20H23N3O3
Mol. Mass.353.4149
SMILESCC(C)(C)c1ccc(cc1)-c1noc(CCC(=O)NCc2ccco2)n1