Reaction Details
TargetEndothelial PAS domain-containing protein 1
LigandBDBM94058
Substrate/Competitorn/a
IC50<1000±n/a nM
Citation PubChem, PC Dose response confirmation of uHTS identification of HIF-2a Inhibitors in a luminesence assay PubChem Bioassay(2012)[AID]
 
Endothelial PAS domain-containing protein 1
Name:Endothelial PAS domain-containing protein 1
Type:PROTEIN
Mol. Mass.:96453.58
Organism:Homo sapiens (Human)
Description:ChEMBL_1506501
Residue:870
BDBM94058
NameBDBM94058
Synonyms:3-(4-aminophenyl)-2-benzopyran-1-one 3-(4-aminophenyl)isocoumarin SMR001216466 | cid_24896921
TypeSmall organic molecule
Emp. Form.C15H11NO2
Mol. Mass.237.2533
SMILESNc1ccc(cc1)-c1cc2ccccc2c(=O)o1