Reaction Details
TargetCorticotropin-releasing factor-binding protein
LigandBDBM57846
Substrate/Competitorn/a
IC50 3210±n/a nM
Citation PubChem, PC Dose Response confirmation of uHTS hits for small molecule antagonists of the CRF-binding protein and CRF-R2 receptor complex in 384 well format PubChem Bioassay(2012)[AID]
 
Corticotropin-releasing factor-binding protein
Name:Corticotropin-releasing factor-binding protein
Type:Enzyme Catalytic Domain
Mol. Mass.:36143.95
Organism:Homo sapiens (Human)
Description:P24387
Residue:322
BDBM57846
NameBDBM57846
Synonyms:2-(2-methylphenyl)-5-(4-nitrophenyl)-1H-pyrazolo[1,5-a]pyrimidin-7-one MLS000713753 cid_780981
TypeSmall organic molecule
Emp. Form.C19H14N4O3
Mol. Mass.346.3395
SMILESCc1ccccc1-c1cc2nc(cc(=O)n2[nH]1)-c1ccc(cc1)[N+]([O-])=O