Reaction Details
TargetCorticotropin-releasing factor-binding protein
LigandBDBM89721
Substrate/Competitorn/a
IC50 941±n/a nM
Citation PubChem, PC Dose Response confirmation of uHTS hits for small molecule antagonists of the CRF-binding protein and CRF-R2 receptor complex in 384 well format PubChem Bioassay(2012)[AID]
 
Corticotropin-releasing factor-binding protein
Name:Corticotropin-releasing factor-binding protein
Type:Enzyme Catalytic Domain
Mol. Mass.:36143.95
Organism:Homo sapiens (Human)
Description:P24387
Residue:322
BDBM89721
NameBDBM89721
Synonyms:5-[(2-chloranyl-4-fluoranyl-phenyl)methylsulfanyl]-1,3,4-thiadiazol-2-amine 5-[(2-chloro-4-fluorophenyl)methylsulfanyl]-1,3,4-thiadiazol-2-amine MLS000064707 [5-[(2-chloro-4-fluoro-benzyl)thio]-1,3,4-thiadiazol-2-yl]amine | cid_972610
TypeSmall organic molecule
Emp. Form.C9H7ClFN3S2
Mol. Mass.275.753
SMILESNc1nnc(SCc2ccc(F)cc2Cl)s1