Reaction Details
TargetCorticotropin-releasing factor-binding protein
LigandBDBM91361
Substrate/Competitorn/a
IC50 1720±n/a nM
Citation PubChem, PC Dose Response confirmation of uHTS hits for small molecule antagonists of the CRF-binding protein and CRF-R2 receptor complex in 384 well format PubChem Bioassay(2012)[AID]
 
Corticotropin-releasing factor-binding protein
Name:Corticotropin-releasing factor-binding protein
Type:Enzyme Catalytic Domain
Mol. Mass.:36143.95
Organism:Homo sapiens (Human)
Description:P24387
Residue:322
BDBM91361
NameBDBM91361
Synonyms:(1S,3R,12bS)-9-chloranyl-3-[2-[[(2E)-3,7-dimethylocta-2,6-dienyl]amino]-2-oxidanylidene-ethyl]-N,N-diethyl-12b-methyl-4-oxidanylidene-1,2,3,6,7,12-hexahydroindolo[2,3-a]quinolizine-1-carboxamide (1S,3R,12bS)-9-chloro-3-[2-[[(2E)-3,7-dimethylocta-2,6-dienyl]amino]-2-oxoethyl]-N,N-diethyl-12b-methyl-4-oxo-1,2,3,6,7,12-hexahydroindolo[2,3-a]quinolizine-1-carboxamide SMR001544141 | cid_44601656
TypeSmall organic molecule
Emp. Form.C33H45ClN4O3
Mol. Mass.581.188
SMILESCCN(CC)C(=O)[C@H]1C[C@H](CC(=O)NC\C=C(/C)CCC=C(C)C)C(=O)N2CCc3c([nH]c4ccc(Cl)cc34)[C@]12C